Reaction Details
TargetSigma non-opioid intracellular receptor 1
LigandBDBM50000066
Substrate/Competitorn/a
Meas. Tech.ChEMBL_201897 (CHEMBL808188)
Ki 0.17±n/a nM
Citation Moriarty, RMEnache, LAZhao, LGilardi, RMattson, MVPrakash, O Rigid phencyclidine analogues. Binding to the phencyclidine and sigma 1 receptors. J Med Chem41:468-77 (1998) 
 
Sigma non-opioid intracellular receptor 1
Name:Sigma non-opioid intracellular receptor 1
Type:Enzyme Catalytic Domain
Mol. Mass.:25266.54
Organism:RAT
Description:Q9R0C9
Residue:223
BDBM50000066
NameBDBM50000066
Synonyms:(2-Azepan-1-yl-ethyl)-[2-(3,4-dichloro-phenyl)-ethyl]-methyl-amine | CHEMBL356688
TypeSmall organic molecule
Emp. Form.C17H26Cl2N2
Mol. Mass.329.308
SMILESCN(CCN1CCCCCC1)CCc1ccc(Cl)c(Cl)c1