Reaction Details
TargetAndrogen receptor
LigandBDBM50063100
Substrate/Competitorn/a
Meas. Tech.ChEMBL_36279 (CHEMBL651953)
Ki 9±n/a nM
Citation Hamann, LGHiguchi, RIZhi, LEdwards, JPWang, XNMarschke, KBKong, JWFarmer, LJJones, TK Synthesis and biological activity of a novel series of nonsteroidal, peripherally selective androgen receptor antagonists derived from 1,2-dihydropyridono[5,6-g]quinolines. J Med Chem41:623-39 (1998) 
 
Androgen receptor
Name:Androgen receptor
Type:Receptor
Mol. Mass.:99185.27
Organism:Homo sapiens (Human)
Description:CHO cells were stably transfected with human AR gene.
Residue:920
BDBM50063100
NameBDBM50063100
Synonyms:6'-trifluoromethylspiro[cyclohexane-1,2'-(1',2',3',4',8',9'-hexahydropyrido[3,2-g]quinoline)]-8'-one | CHEMBL345854
TypeSmall organic molecule
Emp. Form.C18H19F3N2O
Mol. Mass.336.3515
SMILESFC(F)(F)c1cc(=O)[nH]c2cc3NC4(CCCCC4)CCc3cc12