Reaction Details
TargetP-selectin
LigandBDBM50450369
Substrate/Competitorn/a
Meas. Tech.ChEMBL_200013 (CHEMBL810702)
IC50 3400000±n/a nM
Citation Kogan, TPDupré, BBui, HMcAbee, KLKassir, JMScott, ILHu, XVanderslice, PBeck, PJDixon, RA Novel synthetic inhibitors of selectin-mediated cell adhesion: synthesis of 1,6-bis[3-(3-carboxymethylphenyl)-4-(2-alpha-D- mannopyranosyloxy)phenyl]hexane (TBC1269). J Med Chem41:1099-111 (1998) 
 
P-selectin
Name:P-selectin
Type:PROTEIN
Mol. Mass.:90834.61
Organism:Homo sapiens (Human)
Description:ChEMBL_1438999
Residue:830
BDBM50450369
NameBDBM50450369
Synonyms:SIALYL LEWIS X Sialyl lewis-x sialyl LewisX
TypeSmall organic molecule
Emp. Form.C31H52N2O23
Mol. Mass.820.7442
SMILES[H][C@]1(O[C@@](C[C@H](O)[C@H]1NC(C)=O)(O[C@H]1[C@@H](O)[C@@H](CO)O[C@@H](O[C@H]([C@H](O)CO)[C@H](O[C@@H]2O[C@@H](C)[C@@H](O)[C@@H](O)[C@@H]2O)[C@@H](NC(C)=O)C=O)[C@@H]1O)C(O)=O)[C@H](O)[C@H](O)CO