Reaction Details
TargetBifunctional dihydrofolate reductase-thymidylate synthase
LigandBDBM18784
Substrate/Competitorn/a
Meas. Tech.ChEMBL_209306 (CHEMBL811761)
Ki 0.30±n/a nM
Citation McKie, JHDouglas, KTChan, CRoser, SAYates, RRead, MHyde, JEDascombe, MJYuthavong, YSirawaraporn, W Rational drug design approach for overcoming drug resistance: application to pyrimethamine resistance in malaria. J Med Chem41:1367-70 (1998) 
 
Bifunctional dihydrofolate reductase-thymidylate synthase
Name:Bifunctional dihydrofolate reductase-thymidylate synthase
Type:Enzyme
Mol. Mass.:71822.51
Organism:Plasmodium falciparum (isolate K1 / Thailand)
Description:The mutant clone was prepared by cassette mutagenesis using wildtype pfDHFR as a template, and expressed in E. coli.
Residue:608
BDBM18784
NameBDBM18784
Synonyms:5-(3-chlorophenyl)-6-ethylpyrimidine-2,4-diamine P30
TypeSmall organic molecule
Emp. Form.C12H13ClN4
Mol. Mass.248.711
SMILESCCc1nc(N)nc(N)c1-c1cccc(Cl)c1