Reaction Details
TargetEndothelin-converting enzyme 1
LigandBDBM50064113
Substrate/Competitorn/a
Meas. Tech.ChEMBL_64360 (CHEMBL679847)
IC50 28±n/a nM
Citation Wallace, EMMoliterni, JAMoskal, MANeubert, ADMarcopulos, NStamford, LBTrapani, AJSavage, PChou, MJeng, AY Design and synthesis of potent, selective inhibitors of endothelin-converting enzyme. J Med Chem41:1513-23 (1998) 
 
Endothelin-converting enzyme 1
Name:Endothelin-converting enzyme 1
Type:Enzyme
Mol. Mass.:87155.11
Organism:Homo sapiens (Human)
Description:P42892
Residue:770
BDBM50064113
NameBDBM50064113
Synonyms:CHEMBL40168 | {[(S)-1-(2-Biphenyl-4-yl-ethylcarbamoyl)-4-(2,4-difluoro-phenyl)-but-3-ynylamino]-methyl}-phosphonic acid
TypeSmall organic molecule
Emp. Form.C26H25F2N2O4P
Mol. Mass.498.4583
SMILESOP(O)(=O)CN[C@@H](CC#Cc1ccc(F)cc1F)C(=O)NCCc1ccc(cc1)-c1ccccc1