Reaction Details
TargetNeprilysin
LigandBDBM50064106
Substrate/Competitorn/a
Meas. Tech.ChEMBL_144609 (CHEMBL751028)
IC50 1±n/a nM
Citation Wallace, EMMoliterni, JAMoskal, MANeubert, ADMarcopulos, NStamford, LBTrapani, AJSavage, PChou, MJeng, AY Design and synthesis of potent, selective inhibitors of endothelin-converting enzyme. J Med Chem41:1513-23 (1998) 
 
Neprilysin
Name:Neprilysin
Type:Enzyme
Mol. Mass.:85505.38
Organism:Homo sapiens (Human)
Description:P08473
Residue:750
BDBM50064106
NameBDBM50064106
Synonyms:CGS-26303 {[(R)-2-Biphenyl-4-yl-1-(1H-tetrazol-5-yl)-ethylamino]-methyl}-phosphonic acid {[(S)-2-Biphenyl-4-yl-1-(2H-tetrazol-5-yl)-ethylamino]-methyl}-phosphonic acid | {[2-Biphenyl-4-yl-1-(1H-tetrazol-5-yl)-ethylamino]-methyl}-phosphonic acid(CGS 26303)
TypeSmall organic molecule
Emp. Form.C16H18N5O3P
Mol. Mass.359.3196
SMILESOP(O)(=O)CN[C@@H](Cc1ccc(cc1)-c1ccccc1)c1nnn[nH]1