Reaction Details
TargetEndothelin-converting enzyme 1
LigandBDBM50064125
Substrate/Competitorn/a
Meas. Tech.ChEMBL_64360 (CHEMBL679847)
IC50 14±n/a nM
Citation Wallace, EMMoliterni, JAMoskal, MANeubert, ADMarcopulos, NStamford, LBTrapani, AJSavage, PChou, MJeng, AY Design and synthesis of potent, selective inhibitors of endothelin-converting enzyme. J Med Chem41:1513-23 (1998) 
 
Endothelin-converting enzyme 1
Name:Endothelin-converting enzyme 1
Type:Enzyme
Mol. Mass.:87155.11
Organism:Homo sapiens (Human)
Description:P42892
Residue:770
BDBM50064125
NameBDBM50064125
Synonyms:(S)-3-Cyclohexyl-2-[(S)-5-(2,4-difluoro-phenyl)-2-(phosphonomethyl-amino)-pent-4-ynoylamino]-propionic acid | CHEMBL39828
TypeSmall organic molecule
Emp. Form.C21H27F2N2O6P
Mol. Mass.472.4194
SMILESOC(=O)[C@H](CC1CCCCC1)NC(=O)[C@H](CC#Cc1ccc(F)cc1F)NCP(O)(O)=O