Reaction Details
TargetPhenylethanolamine N-methyltransferase
LigandBDBM13016
Substrate/Competitorn/a
Meas. Tech.ChEMBL_152398 (CHEMBL764114)
Ki 9700±n/a nM
Citation Grunewald, GLDahanukar, VHJalluri, RKCriscione, KR Synthesis, biochemical evaluation, and classical and three-dimensional quantitative structure-activity relationship studies of 7-substituted-1,2,3,4-tetrahydroisoquinolines and their relative affinities toward phenylethanolamine N-methyltransferase and the alpha2-adrenoceptor. J Med Chem42:118-34 (1999) 
 
Phenylethanolamine N-methyltransferase
Name:Phenylethanolamine N-methyltransferase
Type:Enzyme
Mol. Mass.:30916.97
Organism:Bos taurus (bovine)
Description:n/a
Residue:283
BDBM13016
NameBDBM13016
Synonyms:1,2,3,4-tetrahydroisoquinoline THIQ 6 | tetrahydroisoquinoline
TypeSmall organic molecule
Emp. Form.C9H11N
Mol. Mass.133.1903
SMILESC1Cc2ccccc2CN1