Reaction Details
Target72 kDa type IV collagenase
LigandBDBM8465
Substrate/Competitorn/a
Meas. Tech.ChEMBL_104380 (CHEMBL715841)
IC50 9.1±n/a nM
Citation Pikul, SMcDow Dunham, KLAlmstead, NGDe, BNatchus, MGAnastasio, MVMcPhail, SJSnider, CETaiwo, YOChen, LDunaway, CMGu, FMieling, GE Design and synthesis of phosphinamide-based hydroxamic acids as inhibitors of matrix metalloproteinases. J Med Chem42:87-94 (1999) 
 
72 kDa type IV collagenase
Name:72 kDa type IV collagenase
Type:Enzyme
Mol. Mass.:73870.36
Organism:Homo sapiens (Human)
Description: P08253
Residue:660
BDBM8465
NameBDBM8465
Synonyms:(2R)-N-hydroxy-2-[(4-methoxybenzene)(pyridin-3-ylmethyl)sulfonamido]-3-methylbutanamide CGS 27023 CHEMBL514138 | hydroxamate analogue 1
TypeSmall organic molecule
Emp. Form.C18H23N3O5S
Mol. Mass.393.457
SMILESCOc1ccc(cc1)S(=O)(=O)N(Cc1cccnc1)[C@H](C(C)C)C(=O)NO