Reaction Details
TargetMuscarinic acetylcholine receptor M2
LigandBDBM50072215
Substrate/Competitorn/a
Meas. Tech.ChEMBL_140047 (CHEMBL745864)
IC50 14±n/a nM
Citation Jeppesen, LOlesen, PHHansen, LSheardown, MJThomsen, CRasmussen, TJensen, AFChristensen, MSRimvall, KWard, JSWhitesitt, CCalligaro, DOBymaster, FPDelapp, NWFelder, CCShannon, HESauerberg, P 1-(1,2,5-Thiadiazol-4-yl)-4-azatricyclo[2.2.1.0(2,6)]heptanes as new potent muscarinic M1 agonists: structure-activity relationship for 3-aryl-2-propyn-1-yloxy and 3-aryl-2-propyn-1-ylthio derivatives. J Med Chem42:1999-2006 (1999) 
 
Muscarinic acetylcholine receptor M2
Name:Muscarinic acetylcholine receptor M2
Type:Enzyme Catalytic Domain
Mol. Mass.:51555.53
Organism:RAT
Description:P10980
Residue:466
BDBM50072215
NameBDBM50072215
Synonyms:1-Methyl-5-[4-(3-phenyl-prop-2-ynyloxy)-[1,2,5]thiadiazol-3-yl]-1,2,3,6-tetrahydro-pyridine CHEMBL291351
TypeSmall organic molecule
Emp. Form.C17H17N3OS
Mol. Mass.311.401
SMILESCN1CCC=C(C1)c1nsnc1OCC#Cc1ccccc1