Reaction Details
TargetCarbonic anhydrase 1
LigandBDBM10858
Substrate/Competitorn/a
Meas. Tech.ChEMBL_47514 (CHEMBL657824)
Ki 78500±n/a nM
Citation Scozzafava, AMenabuoni, LMincione, FBriganti, FMincione, GSupuran, CT Carbonic anhydrase inhibitors. Synthesis of water-soluble, topically effective, intraocular pressure-lowering aromatic/heterocyclic sulfonamides containing cationic or anionic moieties: is the tail more important than the ring? J Med Chem42:2641-50 (1999) 
 
Carbonic anhydrase 1
Name:Carbonic anhydrase 1
Type:Enzyme
Mol. Mass.:28873.37
Organism:Homo sapiens (Human)
Description:P00915
Residue:261
BDBM10858
NameBDBM10858
Synonyms:4-hydrazinylbenzene-1-sulfonamide aromatic/heteroaromatic sulfonamide 3 | hydrazide deriv. 14
TypeSmall organic molecule
Emp. Form.C6H9N3O2S
Mol. Mass.187.22
SMILESNNc1ccc(cc1)S(N)(=O)=O