Reaction Details
TargetTelomerase reverse transcriptase
LigandBDBM50068321
Substrate/Competitorn/a
Meas. Tech.ChEMBL_210073 (CHEMBL813597)
IC50 3100±n/a nM
Citation Perry, PJRead, MADavies, RTGowan, SMReszka, APWood, AAKelland, LRNeidle, S 2,7-Disubstituted amidofluorenone derivatives as inhibitors of human telomerase. J Med Chem42:2679-84 (1999) 
 
Telomerase reverse transcriptase
Name:Telomerase reverse transcriptase
Type:PROTEIN
Mol. Mass.:127099.03
Organism:Homo sapiens (Human)
Description:ChEMBL_1447029
Residue:1132
BDBM50068321
NameBDBM50068321
Synonyms:2,7-Bis[3-(piperidino)propionamido]anthraquinone N-[9,10-Dioxo-7-(3-piperidin-1-yl-propionylamino)-9,10-dihydro-anthracen-2-yl]-3-piperidin-1-yl-propionamide
TypeSmall organic molecule
Emp. Form.C30H36N4O4
Mol. Mass.516.6312
SMILESO=C(CCN1CCCCC1)Nc1ccc2C(=O)c3ccc(NC(=O)CCN4CCCCC4)cc3C(=O)c2c1