Reaction Details
TargetSerine protease 1
LigandBDBM50369433
Substrate/Competitorn/a
Meas. Tech.ChEMBL_212879 (CHEMBL824707)
Ki 55±n/a nM
Citation Quan, MLLiauw, AYEllis, CDPruitt, JRCarini, DJBostrom, LLHuang, PPHarrison, KKnabb, RMThoolen, MJWong, PCWexler, RR Design and synthesis of isoxazoline derivatives as factor Xa inhibitors. 1. J Med Chem42:2752-9 (1999) 
 
Serine protease 1
Name:Serine protease 1
Type:Enzyme
Mol. Mass.:26557.80
Organism:Homo sapiens (Human)
Description:P07477
Residue:247
BDBM50369433
NameBDBM50369433
Synonyms:CHEMBL1202108
TypeSmall organic molecule
Emp. Form.C21H33BN6O5
Mol. Mass.460.335
SMILES[#6]-[#6](=O)-[#7]-[#6@H](-[#6]-c1ccccc1)-[#6](=O)-[#7]-1-[#6]-[#6]-[#6]-[#6@@H]-1-[#6](=O)-[#7]-[#6](-[#6]-[#6]-[#6]\[#7]=[#6](\[#7])-[#7])-[#5](-[#8])-[#8]