Reaction Details
TargetSerine protease 1
LigandBDBM50072445
Substrate/Competitorn/a
Meas. Tech.ChEMBL_212880 (CHEMBL824708)
Ki 98.0±n/a nM
Citation Quan, MLLiauw, AYEllis, CDPruitt, JRCarini, DJBostrom, LLHuang, PPHarrison, KKnabb, RMThoolen, MJWong, PCWexler, RR Design and synthesis of isoxazoline derivatives as factor Xa inhibitors. 1. J Med Chem42:2752-9 (1999) 
 
Serine protease 1
Name:Serine protease 1
Type:Enzyme
Mol. Mass.:26557.80
Organism:Homo sapiens (Human)
Description:P07477
Residue:247
BDBM50072445
NameBDBM50072445
Synonyms:CHEMBL139063 [3-(3-Carbamimidoyl-phenyl)-5-(2'-sulfamoyl-biphenyl-4-ylcarbamoyl)-4,5-dihydro-isoxazol-5-yl]-acetic acid methyl ester; TFA
TypeSmall organic molecule
Emp. Form.C26H25N5O6S
Mol. Mass.535.572
SMILESCOC(=O)CC1(CC(=NO1)c1cccc(c1)C(N)=N)C(=O)Nc1ccc(cc1)-c1ccccc1S(N)(=O)=O