Reaction Details
TargetCoagulation factor X
LigandBDBM50079222
Substrate/Competitorn/a
Meas. Tech.ChEMBL_49168 (CHEMBL663267)
Ki 12±n/a nM
Citation Quan, MLLiauw, AYEllis, CDPruitt, JRCarini, DJBostrom, LLHuang, PPHarrison, KKnabb, RMThoolen, MJWong, PCWexler, RR Design and synthesis of isoxazoline derivatives as factor Xa inhibitors. 1. J Med Chem42:2752-9 (1999) 
 
Coagulation factor X
Name:Coagulation factor X
Type:Enzyme
Mol. Mass.:54726.60
Organism:Homo sapiens (Human)
Description:n/a
Residue:488
BDBM50079222
NameBDBM50079222
Synonyms:CHEMBL327213 | {3-(3-Carbamimidoyl-phenyl)-5-[5-(2-sulfamoyl-phenyl)-pyrimidin-2-ylcarbamoyl]-4,5-dihydro-isoxazol-5-yl}-acetic acid methyl ester; TFA
TypeSmall organic molecule
Emp. Form.C24H23N7O6S
Mol. Mass.537.548
SMILESCOC(=O)CC1(CC(=NO1)c1cccc(c1)C(N)=N)C(=O)Nc1ncc(cn1)-c1ccccc1S(N)(=O)=O