Reaction Details
TargetSerine protease 1
LigandBDBM50079222
Substrate/Competitorn/a
Meas. Tech.ChEMBL_212880 (CHEMBL824708)
Ki 710±n/a nM
Citation Quan, MLLiauw, AYEllis, CDPruitt, JRCarini, DJBostrom, LLHuang, PPHarrison, KKnabb, RMThoolen, MJWong, PCWexler, RR Design and synthesis of isoxazoline derivatives as factor Xa inhibitors. 1. J Med Chem42:2752-9 (1999) 
 
Serine protease 1
Name:Serine protease 1
Type:Enzyme
Mol. Mass.:26557.80
Organism:Homo sapiens (Human)
Description:P07477
Residue:247
BDBM50079222
NameBDBM50079222
Synonyms:CHEMBL327213 | {3-(3-Carbamimidoyl-phenyl)-5-[5-(2-sulfamoyl-phenyl)-pyrimidin-2-ylcarbamoyl]-4,5-dihydro-isoxazol-5-yl}-acetic acid methyl ester; TFA
TypeSmall organic molecule
Emp. Form.C24H23N7O6S
Mol. Mass.537.548
SMILESCOC(=O)CC1(CC(=NO1)c1cccc(c1)C(N)=N)C(=O)Nc1ncc(cn1)-c1ccccc1S(N)(=O)=O