Reaction Details
Target5-hydroxytryptamine receptor 4
LigandBDBM29525
Substrate/Competitorn/a
Meas. Tech.ChEMBL_3276 (CHEMBL619077)
Ki 0.11±n/a nM
Citation Tapia, IAlonso-Cires, LLópez-Tudanca, PLMosquera, RLabeaga, LInnerárity, AOrjales, A 2,3-Dihydro-2-oxo-1H-benzimidazole-1-carboxamides with selective affinity for the 5-HT(4) receptor: synthesis and structure-affinity and structure-activity relationships of a new series of partial agonist and antagonist derivatives. J Med Chem42:2870-80 (1999) 
 
5-hydroxytryptamine receptor 4
Name:5-hydroxytryptamine receptor 4
Type:Enzyme Catalytic Domain
Mol. Mass.:43735.29
Organism:GUINEA PIG
Description:5-HT4 HTR4 GUINEA PIG::O70528
Residue:388
BDBM29525
NameBDBM29525
Synonyms:3H-GR113808 GR 113808 [3H]GR113808
Typeradiolabeled ligand
Emp. Form.C19H27N3O4S
Mol. Mass.393.5
SMILESCn1cc(C(=O)OCC2CCN(CCNS(C)(=O)=O)CC2)c2ccccc12