Reaction Details
TargetHistamine H1 receptor
LigandBDBM50010859
Substrate/Competitorn/a
Meas. Tech.ChEMBL_84698 (CHEMBL692702)
IC50 0.06±n/a nM
Citation Quiñones-Torrelo, CSagrado, SVillanueva-Camañas, RMMedina-Hernández, MJ Development of predictive retention-activity relationship models of tricyclic antidepressants by micellar liquid chromatography. J Med Chem42:3154-62 (1999) 
 
Histamine H1 receptor
Name:Histamine H1 receptor
Type:Enzyme Catalytic Domain
Mol. Mass.:55716.35
Organism:RAT
Description:HISTAMINE H1 HRH1 RAT::P31390
Residue:486
BDBM50010859
NameBDBM50010859
Synonyms:CHEMBL11 IMIPRAMINE PAMOATE | Imipramin
TypeSmall organic molecule
Emp. Form.C19H24N2
Mol. Mass.280.4073
SMILESCN(C)CCCN1c2ccccc2CCc2ccccc12