Reaction Details
TargetProthrombin
LigandBDBM50070632
Substrate/Competitorn/a
Meas. Tech.ChEMBL_208915 (CHEMBL814970)
Ki 23±n/a nM
Citation Mason, JSMorize, IMenard, PRCheney, DLHulme, CLabaudiniere, RF New 4-point pharmacophore method for molecular similarity and diversity applications: overview of the method and applications, including a novel approach to the design of combinatorial libraries containing privileged substructures. J Med Chem42:3251-64 (1999) 
 
Prothrombin
Name:Prothrombin
Type:Protein
Mol. Mass.:70029.57
Organism:Homo sapiens (Human)
Description:P00734
Residue:622
BDBM50070632
NameBDBM50070632
Synonyms:4-[2-(3-Benzenesulfonylamino-phenoxy)-ethylamino]-pyridinium N-{3-[2-(Pyridin-4-ylamino)-ethoxy]-phenyl}-benzenesulfonamide
TypeSmall organic molecule
Emp. Form.C19H19N3O3S
Mol. Mass.369.437
SMILESO=S(=O)(Nc1cccc(OCCNc2ccncc2)c1)c1ccccc1