Reaction Details
TargetBifunctional purine biosynthesis protein ATIC
LigandBDBM22579
Substrate/Competitorn/a
Meas. Tech.ChEMBL_28428 (CHEMBL875660)
IC50 25000±n/a nM
Citation Wall, MShim, JHBenkovic, SJ A multisubstrate adduct inhibitor of AICAR transformylase. J Med Chem42:3421-4 (1999) 
 
Bifunctional purine biosynthesis protein ATIC
Name:Bifunctional purine biosynthesis protein ATIC
Type:Protein
Mol. Mass.:64616.62
Organism:Homo sapiens (Human)
Description:P31939
Residue:592
BDBM22579
NameBDBM22579
Synonyms:AICAR CHEMBL483849 {[(2R,3S,4R,5R)-5-(5-amino-4-carbamoyl-1H-imidazol-1-yl)-3,4-dihydroxyoxolan-2-yl]methoxy}phosphonic acid
TypeNucleoside or nucleotide
Emp. Form.C9H15N4O8P
Mol. Mass.338.2112
SMILESNC(=O)c1ncn([C@@H]2O[C@H](COP(O)(O)=O)[C@@H](O)[C@H]2O)c1N