Reaction Details
TargetCoagulation factor X
LigandBDBM50080474
Substrate/Competitorn/a
Meas. Tech.ChEMBL_49301 (CHEMBL661582)
Ki 1100±n/a nM
Citation Ewing, WRBecker, MRManetta, VEDavis, RSPauls, HWMason, HChoi-Sledeski, YMGreen, DCha, DSpada, APCheney, DLMason, JSMaignan, SGuilloteau, JPBrown, KColussi, DBentley, RBostwick, JKasiewski, CJMorgan, SRLeadley, RJDunwiddie, CTPerrone, MHChu, V Design and structure-activity relationships of potent and selective inhibitors of blood coagulation factor Xa. J Med Chem42:3557-71 (1999) 
 
Coagulation factor X
Name:Coagulation factor X
Type:Enzyme
Mol. Mass.:54726.60
Organism:Homo sapiens (Human)
Description:n/a
Residue:488
BDBM50080474
NameBDBM50080474
Synonyms:3-[(S)-3-(4-Benzyl-benzenesulfonylamino)-2-oxo-pyrrolidin-1-ylmethyl]-benzamidine | CHEMBL326316
TypeSmall organic molecule
Emp. Form.C25H26N4O3S
Mol. Mass.462.564
SMILESNC(=N)c1cccc(CN2CC[C@H](NS(=O)(=O)c3ccc(Cc4ccccc4)cc3)C2=O)c1