Reaction Details
TargetCoagulation factor X
LigandBDBM50080479
Substrate/Competitorn/a
Meas. Tech.ChEMBL_49301 (CHEMBL661582)
Ki 340±n/a nM
Citation Ewing, WRBecker, MRManetta, VEDavis, RSPauls, HWMason, HChoi-Sledeski, YMGreen, DCha, DSpada, APCheney, DLMason, JSMaignan, SGuilloteau, JPBrown, KColussi, DBentley, RBostwick, JKasiewski, CJMorgan, SRLeadley, RJDunwiddie, CTPerrone, MHChu, V Design and structure-activity relationships of potent and selective inhibitors of blood coagulation factor Xa. J Med Chem42:3557-71 (1999) 
 
Coagulation factor X
Name:Coagulation factor X
Type:Enzyme
Mol. Mass.:54726.60
Organism:Homo sapiens (Human)
Description:n/a
Residue:488
BDBM50080479
NameBDBM50080479
Synonyms:CHEMBL117156 | N-(3-Carbamimidoyl-benzyl)-2-(naphthalene-2-sulfonylamino)-acetamide
TypeSmall organic molecule
Emp. Form.C20H20N4O3S
Mol. Mass.396.463
SMILESNC(=N)c1cccc(CNC(=O)CNS(=O)(=O)c2ccc3ccccc3c2)c1