Reaction Details
TargetCoagulation factor X
LigandBDBM50080492
Substrate/Competitorn/a
Meas. Tech.ChEMBL_49301 (CHEMBL661582)
Ki 83±n/a nM
Citation Ewing, WRBecker, MRManetta, VEDavis, RSPauls, HWMason, HChoi-Sledeski, YMGreen, DCha, DSpada, APCheney, DLMason, JSMaignan, SGuilloteau, JPBrown, KColussi, DBentley, RBostwick, JKasiewski, CJMorgan, SRLeadley, RJDunwiddie, CTPerrone, MHChu, V Design and structure-activity relationships of potent and selective inhibitors of blood coagulation factor Xa. J Med Chem42:3557-71 (1999) 
 
Coagulation factor X
Name:Coagulation factor X
Type:Enzyme
Mol. Mass.:54726.60
Organism:Homo sapiens (Human)
Description:n/a
Residue:488
BDBM50080492
NameBDBM50080492
Synonyms:5-[(S)-3-(7-Methoxy-naphthalene-2-sulfonylamino)-2-oxo-pyrrolidin-1-ylmethyl]-thiophene-3-carboxamidine | CHEMBL331939
TypeSmall organic molecule
Emp. Form.C21H22N4O4S2
Mol. Mass.458.554
SMILESCOc1ccc2ccc(cc2c1)S(=O)(=O)N[C@H]1CCN(Cc2cc(cs2)C(N)=N)C1=O