Reaction Details
TargetAnionic trypsin
LigandBDBM50080477
Substrate/Competitorn/a
Meas. Tech.ChEMBL_212180 (CHEMBL817744)
Ki 2900±n/a nM
Citation Ewing, WRBecker, MRManetta, VEDavis, RSPauls, HWMason, HChoi-Sledeski, YMGreen, DCha, DSpada, APCheney, DLMason, JSMaignan, SGuilloteau, JPBrown, KColussi, DBentley, RBostwick, JKasiewski, CJMorgan, SRLeadley, RJDunwiddie, CTPerrone, MHChu, V Design and structure-activity relationships of potent and selective inhibitors of blood coagulation factor Xa. J Med Chem42:3557-71 (1999) 
 
Anionic trypsin
Name:Anionic trypsin
Type:PROTEIN
Mol. Mass.:26281.39
Organism:Bos taurus
Description:ChEMBL_212177
Residue:247
BDBM50080477
NameBDBM50080477
Synonyms:3-[(S)-3-(Naphthalene-2-sulfonylamino)-2-oxo-pyrrolidin-1-ylmethyl]-benzamidine CHEMBL93796 | RPR-118071
TypeSmall organic molecule
Emp. Form.C22H22N4O3S
Mol. Mass.422.5
SMILESNC(=N)c1cccc(CN2CC[C@H](NS(=O)(=O)c3ccc4ccccc4c3)C2=O)c1