Reaction Details
TargetProthrombin
LigandBDBM50080507
Substrate/Competitorn/a
Meas. Tech.ChEMBL_208339 (CHEMBL813571)
Ki>4000±n/a nM
Citation Ewing, WRBecker, MRManetta, VEDavis, RSPauls, HWMason, HChoi-Sledeski, YMGreen, DCha, DSpada, APCheney, DLMason, JSMaignan, SGuilloteau, JPBrown, KColussi, DBentley, RBostwick, JKasiewski, CJMorgan, SRLeadley, RJDunwiddie, CTPerrone, MHChu, V Design and structure-activity relationships of potent and selective inhibitors of blood coagulation factor Xa. J Med Chem42:3557-71 (1999) 
 
Prothrombin
Name:Prothrombin
Type:Protein
Mol. Mass.:70029.57
Organism:Homo sapiens (Human)
Description:P00734
Residue:622
BDBM50080507
NameBDBM50080507
Synonyms:4-[(S)-3-(7-Methoxy-naphthalene-2-sulfonylamino)-2-oxo-pyrrolidin-1-ylmethyl]-furan-2-carboxamidine | CHEMBL120749
TypeSmall organic molecule
Emp. Form.C21H22N4O5S
Mol. Mass.442.488
SMILESCOc1ccc2ccc(cc2c1)S(=O)(=O)N[C@H]1CCN(Cc2coc(c2)C(N)=N)C1=O