Reaction Details
TargetCoagulation factor X
LigandBDBM50080501
Substrate/Competitorn/a
Meas. Tech.ChEMBL_49301 (CHEMBL661582)
Ki 41±n/a nM
Citation Ewing, WRBecker, MRManetta, VEDavis, RSPauls, HWMason, HChoi-Sledeski, YMGreen, DCha, DSpada, APCheney, DLMason, JSMaignan, SGuilloteau, JPBrown, KColussi, DBentley, RBostwick, JKasiewski, CJMorgan, SRLeadley, RJDunwiddie, CTPerrone, MHChu, V Design and structure-activity relationships of potent and selective inhibitors of blood coagulation factor Xa. J Med Chem42:3557-71 (1999) 
 
Coagulation factor X
Name:Coagulation factor X
Type:Enzyme
Mol. Mass.:54726.60
Organism:Homo sapiens (Human)
Description:n/a
Residue:488
BDBM50080501
NameBDBM50080501
Synonyms:3-{(S)-3-[Benzyl-(7-methoxy-naphthalene-2-sulfonyl)-amino]-2-oxo-pyrrolidin-1-ylmethyl}-benzamidine | CHEMBL340336
TypeSmall organic molecule
Emp. Form.C30H30N4O4S
Mol. Mass.542.649
SMILESCOc1ccc2ccc(cc2c1)S(=O)(=O)N(Cc1ccccc1)[C@H]1CCN(Cc2cccc(c2)C(N)=N)C1=O