Reaction Details
TargetProthrombin
LigandBDBM50080505
Substrate/Competitorn/a
Meas. Tech.ChEMBL_208339 (CHEMBL813571)
Ki>4000±n/a nM
Citation Ewing, WRBecker, MRManetta, VEDavis, RSPauls, HWMason, HChoi-Sledeski, YMGreen, DCha, DSpada, APCheney, DLMason, JSMaignan, SGuilloteau, JPBrown, KColussi, DBentley, RBostwick, JKasiewski, CJMorgan, SRLeadley, RJDunwiddie, CTPerrone, MHChu, V Design and structure-activity relationships of potent and selective inhibitors of blood coagulation factor Xa. J Med Chem42:3557-71 (1999) 
 
Prothrombin
Name:Prothrombin
Type:Protein
Mol. Mass.:70029.57
Organism:Homo sapiens (Human)
Description:P00734
Residue:622
BDBM50080505
NameBDBM50080505
Synonyms:CHEMBL324337 | [[(S)-1-(3-Carbamimidoyl-benzyl)-2-oxo-pyrrolidin-3-yl]-(7-methoxy-naphthalene-2-sulfonyl)-amino]-acetic acid
TypeSmall organic molecule
Emp. Form.C25H26N4O6S
Mol. Mass.510.562
SMILESCOc1ccc2ccc(cc2c1)S(=O)(=O)N(CC(O)=O)[C@H]1CCN(Cc2cccc(c2)C(N)=N)C1=O