Reaction Details
TargetProthrombin
LigandBDBM50080506
Substrate/Competitorn/a
Meas. Tech.ChEMBL_208339 (CHEMBL813571)
Ki 1340±n/a nM
Citation Ewing, WRBecker, MRManetta, VEDavis, RSPauls, HWMason, HChoi-Sledeski, YMGreen, DCha, DSpada, APCheney, DLMason, JSMaignan, SGuilloteau, JPBrown, KColussi, DBentley, RBostwick, JKasiewski, CJMorgan, SRLeadley, RJDunwiddie, CTPerrone, MHChu, V Design and structure-activity relationships of potent and selective inhibitors of blood coagulation factor Xa. J Med Chem42:3557-71 (1999) 
 
Prothrombin
Name:Prothrombin
Type:Protein
Mol. Mass.:70029.57
Organism:Homo sapiens (Human)
Description:P00734
Residue:622
BDBM50080506
NameBDBM50080506
Synonyms:3-[(S)-3-(7-Methyl-naphthalene-2-sulfonylamino)-2-oxo-pyrrolidin-1-ylmethyl]-benzamidine | CHEMBL332619
TypeSmall organic molecule
Emp. Form.C23H24N4O3S
Mol. Mass.436.527
SMILESCc1ccc2ccc(cc2c1)S(=O)(=O)N[C@H]1CCN(Cc2cccc(c2)C(N)=N)C1=O