Reaction Details
TargetCoagulation factor X
LigandBDBM50080484
Substrate/Competitorn/a
Meas. Tech.ChEMBL_49301 (CHEMBL661582)
Ki 9800±n/a nM
Citation Ewing, WRBecker, MRManetta, VEDavis, RSPauls, HWMason, HChoi-Sledeski, YMGreen, DCha, DSpada, APCheney, DLMason, JSMaignan, SGuilloteau, JPBrown, KColussi, DBentley, RBostwick, JKasiewski, CJMorgan, SRLeadley, RJDunwiddie, CTPerrone, MHChu, V Design and structure-activity relationships of potent and selective inhibitors of blood coagulation factor Xa. J Med Chem42:3557-71 (1999) 
 
Coagulation factor X
Name:Coagulation factor X
Type:Enzyme
Mol. Mass.:54726.60
Organism:Homo sapiens (Human)
Description:n/a
Residue:488
BDBM50080484
NameBDBM50080484
Synonyms:3-[(S)-4-(Naphthalene-2-sulfonylamino)-2-oxo-pyrrolidin-1-ylmethyl]-benzamidine | CHEMBL120387
TypeSmall organic molecule
Emp. Form.C22H22N4O3S
Mol. Mass.422.5
SMILESNC(=N)c1cccc(CN2C[C@H](CC2=O)NS(=O)(=O)c2ccc3ccccc3c2)c1