Reaction Details
TargetKappa-type opioid receptor
LigandBDBM50271708
Substrate/Competitorn/a
Meas. Tech.ChEMBL_145851 (CHEMBL756114)
IC50 1140±n/a nM
Citation Houghten, RAPinilla, CAppel, JRBlondelle, SEDooley, CTEichler, JNefzi, AOstresh, JM Mixture-based synthetic combinatorial libraries. J Med Chem42:3743-78 (1999) Kappa-type opioid receptor
Name:Kappa-type opioid receptor
Type:G Protein-Coupled Receptor (GPCR)
Mol. Mass.:42648.76
Organism:Homo sapiens (Human)
Description:P41145
Residue:380
BDBM50271708
NameBDBM50271708
Synonyms:(2S,5R)-2,5-Dicyclohexyl-1-(4-methyl-cyclohexylmethyl)-2,3,5,6-tetrahydro-1H-imidazo[1,2-a]imidazole
TypeSmall organic molecule
Emp. Form.C25H44N3
Mol. Mass.386.6364
SMILESCC1CCC(CN2[C@H](CN3[C@@H](C[NH+]=C23)C2CCCCC2)C2CCCCC2)CC1