Reaction Details
TargetProstaglandin G/H synthase 1
LigandBDBM50369461
Substrate/Competitorn/a
Meas. Tech.ChEMBL_159571 (CHEMBL765858)
IC50 540000±n/a nM
Citation Houghten, RAPinilla, CAppel, JRBlondelle, SEDooley, CTEichler, JNefzi, AOstresh, JM Mixture-based synthetic combinatorial libraries. J Med Chem42:3743-78 (1999) Prostaglandin G/H synthase 1
Name:Prostaglandin G/H synthase 1
Type:Enzyme
Mol. Mass.:68692.62
Organism:Homo sapiens (Human)
Description:P23219
Residue:599
BDBM50369461
NameBDBM50369461
Synonyms:THIAZOLIDINONE
TypeSmall organic molecule
Emp. Form.C3H5NOS
Mol. Mass.103.143
SMILESO=C1CNCS1