Reaction Details
TargetKappa-type opioid receptor
LigandBDBM50369462
Substrate/Competitorn/a
Meas. Tech.ChEMBL_145851 (CHEMBL756114)
IC50 4923±n/a nM
Citation Houghten, RAPinilla, CAppel, JRBlondelle, SEDooley, CTEichler, JNefzi, AOstresh, JM Mixture-based synthetic combinatorial libraries. J Med Chem42:3743-78 (1999) Kappa-type opioid receptor
Name:Kappa-type opioid receptor
Type:G Protein-Coupled Receptor (GPCR)
Mol. Mass.:42648.76
Organism:Homo sapiens (Human)
Description:P41145
Residue:380
BDBM50369462
NameBDBM50369462
Synonyms:CHEMBL121933
TypeSmall organic molecule
Emp. Form.C31H45N3O
Mol. Mass.475.7085
SMILESCOc1ccc(C[C@H]2CN3[C@H](CN=C3N2C(C)C23CC4CC(CC(C4)C2)C3)C2CCCCC2)cc1