Reaction Details
TargetKappa-type opioid receptor
LigandBDBM50271991
Substrate/Competitorn/a
Meas. Tech.ChEMBL_145851 (CHEMBL756114)
IC50 560±n/a nM
Citation Houghten, RAPinilla, CAppel, JRBlondelle, SEDooley, CTEichler, JNefzi, AOstresh, JM Mixture-based synthetic combinatorial libraries. J Med Chem42:3743-78 (1999) Kappa-type opioid receptor
Name:Kappa-type opioid receptor
Type:G Protein-Coupled Receptor (GPCR)
Mol. Mass.:42648.76
Organism:Homo sapiens (Human)
Description:P41145
Residue:380
BDBM50271991
NameBDBM50271991
Synonyms:(2S,5R)-1-(2-{bicyclo[2.2.1]heptan-2-yl}ethyl)-2,5-dicyclohexyl-1H,2H,3H,5H,6H-imidazo[1,2-a]imidazolidin-7-ium | (2S,5S)-1-(2-{bicyclo[2.2.1]heptan-2-yl}ethyl)-2,5-dicyclohexyl-1H,2H,3H,5H,6H-imidazo[1,2-a]imidazolidin-7-ium
TypeSmall organic molecule
Emp. Form.C26H44N3
Mol. Mass.398.6471
SMILESC(CN1C(C[N+]2=C1NCC2C1CCCCC1)C1CCCCC1)C1CC2CCC1C2