Reaction Details
TargetSigma non-opioid intracellular receptor 1
LigandBDBM50081371
Substrate/Competitorn/a
Meas. Tech.ChEMBL_201434 (CHEMBL809837)
IC50 4.5±n/a nM
Citation Nakazato, AKumagai, TOhta, KChaki, SOkuyama, STomisawa, K Synthesis and SAR of 1-alkyl-2-phenylethylamine derivatives designed from N,N-dipropyl-4-methoxy-3-(2-phenylethoxy)phenylethylamine to discover sigma(1) ligands. J Med Chem42:3965-70 (1999) Sigma non-opioid intracellular receptor 1
Name:Sigma non-opioid intracellular receptor 1
Type:Enzyme Catalytic Domain
Mol. Mass.:25124.85
Organism:Homo sapiens (Human)
Description:Q99720
Residue:223
BDBM50081371
NameBDBM50081371
Synonyms:CHEMBL128799 | [1-(4-Methoxy-3-phenethyloxy-benzyl)-butyl]-propyl-amine
TypeSmall organic molecule
Emp. Form.C23H33NO2
Mol. Mass.355.5136
SMILESCCCNC(CCC)Cc1ccc(OC)c(OCCc2ccccc2)c1