Reaction Details
TargetC-X-C chemokine receptor type 4
LigandBDBM50035696
Substrate/Competitorn/a
Meas. Tech.ChEMBL_44679 (CHEMBL884098)
IC50 7.0±n/a nM
Citation Bridger, GJSkerlj, RTPadmanabhan, SMartellucci, SAHenson, GWStruyf, SWitvrouw, MSchols, DDe Clercq, E Synthesis and structure-activity relationships of phenylenebis(methylene)-linked bis-azamacrocycles that inhibit HIV-1 and HIV-2 replication by antagonism of the chemokine receptor CXCR4. J Med Chem42:3971-81 (1999) C-X-C chemokine receptor type 4
Name:C-X-C chemokine receptor type 4
Type:Enzyme
Mol. Mass.:39754.61
Organism:Homo sapiens (Human)
Description:P61073
Residue:352
BDBM50035696
NameBDBM50035696
Synonyms:1,1''-{1,4-phenylenebis(methylene)}-bis{1,4,8,11-tetraaza-cyclotetradecane} 1,4,8,11-tetraazacyclotetradecanyl[4-(1,4,8,11-tetraazacyclotetradecanylmethyl)phenyl]methane(8HBr.2H2O) 11''-xylyl bis-1,4,8,11-tetraazacyclotetradecane AMD-3100 CHEMBL2311089 PLERIXAFOR OCTAHYDROCHLORIDE | US9205085, MSX-162
TypeSmall organic molecule
Emp. Form.C28H54N8
Mol. Mass.502.782
SMILESC(N1CCCNCCNCCCNCC1)c1ccc(CN2CCCNCCNCCCNCC2)cc1