Reaction Details
TargetSubstance-P receptor
LigandBDBM50081932
Substrate/Competitorn/a
Meas. Tech.ChEMBL_143041 (CHEMBL750290)
IC50>1000±n/a nM
Citation Borg, SVollinga, RCLabarre, MPayza, KTerenius, LLuthman, K Design, synthesis, and evaluation of Phe-Gly mimetics: heterocyclic building blocks for pseudopeptides. J Med Chem42:4331-42 (1999) Substance-P receptor
Name:Substance-P receptor
Type:G Protein-Coupled Receptor (GPCR)
Mol. Mass.:46371.54
Organism:Rattus norvegicus (rat)
Description:Competition binding assays were carried out using membrane preparations from transfected CHO cells that constitutively expressed the rat NK1 receptor.
Residue:407
BDBM50081932
NameBDBM50081932
Synonyms:CHEMBL410170 | H-Arg-Pro-Lys-pro-Gln-Gln-Phe-{5-[(S)-1-amino-2-phenylethyl]-1,2,4-triazol-3-ylcarbonyl}-Leu-Met-NH2
TypeSmall organic molecule
Emp. Form.C62H95N19O11S
Mol. Mass.1314.603
SMILESCSCC[C@H](N)C(=O)N[C@@H](CC(C)C)C(=O)c1nnc([nH]1)[C@H](Cc1ccccc1)NC(=O)[C@H](Cc1ccccc1)NC(=O)[C@H](CCC(N)=O)NC(=O)[C@H](CCC(N)=O)NC(=O)[C@@H]1CCCN1C(=O)[C@H](CCCCN)NC(=O)[C@@H]1CCCN1C(=O)[C@@H](N)CCCNC(N)=N