Reaction Details
TargetTelomerase reverse transcriptase
LigandBDBM50080840
Substrate/Competitorn/a
Meas. Tech.ChEMBL_210063 (CHEMBL812639)
IC50 3100±n/a nM
Citation Read, MAWood, AAHarrison, JRGowan, SMKelland, LRDosanjh, HSNeidle, S Molecular modeling studies on G-quadruplex complexes of telomerase inhibitors: structure-activity relationships. J Med Chem42:4538-46 (1999) Telomerase reverse transcriptase
Name:Telomerase reverse transcriptase
Type:PROTEIN
Mol. Mass.:127099.03
Organism:Homo sapiens (Human)
Description:ChEMBL_1447029
Residue:1132
BDBM50080840
NameBDBM50080840
Synonyms:3,6-Bis[3-(azepan-1-yl)propionamido]acridine 3-Azepan-1-yl-N-[6-(3-azepan-1-yl-propionylamino)-acridin-3-yl]-propionamide N,N'-(acridine-3,6-diyl)bis(3-(azepan-1-yl)propanamide)
TypeSmall organic molecule
Emp. Form.C31H41N5O2
Mol. Mass.515.6895
SMILESO=C(CCN1CCCCCC1)Nc1ccc2cc3ccc(NC(=O)CCN4CCCCCC4)cc3nc2c1