Reaction Details
TargetTelomerase reverse transcriptase
LigandBDBM50082532
Substrate/Competitorn/a
Meas. Tech.ChEMBL_210063 (CHEMBL812639)
IC50 4500±n/a nM
Citation Read, MAWood, AAHarrison, JRGowan, SMKelland, LRDosanjh, HSNeidle, S Molecular modeling studies on G-quadruplex complexes of telomerase inhibitors: structure-activity relationships. J Med Chem42:4538-46 (1999) Telomerase reverse transcriptase
Name:Telomerase reverse transcriptase
Type:PROTEIN
Mol. Mass.:127099.03
Organism:Homo sapiens (Human)
Description:ChEMBL_1447029
Residue:1132
BDBM50082532
NameBDBM50082532
Synonyms:2,6-Bis(3-piperidinopropionamido)anthracene-9,10-dione
TypeSmall organic molecule
Emp. Form.C30H40N4O4
Mol. Mass.520.6619
SMILESOc1c2ccc(NC(=O)CC[NH+]3CCCCC3)cc2c(O)c2ccc(NC(=O)CC[NH+]3CCCCC3)cc12