Reaction Details
TargetInterstitial collagenase
LigandBDBM50082540
Substrate/Competitorn/a
Meas. Tech.ChEMBL_105952 (CHEMBL715366)
IC50 1.9±n/a nM
Citation Almstead, NGBradley, RSPikul, SDe, BNatchus, MGTaiwo, YOGu, FWilliams, LEHynd, BAJanusz, MJDunaway, CMMieling, GE Design, synthesis, and biological evaluation of potent thiazine- and thiazepine-based matrix metalloproteinase inhibitors. J Med Chem42:4547-62 (1999) Interstitial collagenase
Name:Interstitial collagenase
Type:Enzyme
Mol. Mass.:54010.26
Organism:Homo sapiens (Human)
Description: P03956
Residue:469
BDBM50082540
NameBDBM50082540
Synonyms:(3S,6R)-6-Hydroxy-4-(4-methoxy-benzenesulfonyl)-2,2-dimethyl-1,1-dioxo-1lambda*6*-[1,4]thiazepane-3-carboxylic acid hydroxyamide | CHEMBL341570
TypeSmall organic molecule
Emp. Form.C15H22N2O8S2
Mol. Mass.422.474
SMILESCOc1ccc(cc1)S(=O)(=O)N1C[C@@H](O)CS(=O)(=O)C(C)(C)[C@@H]1C(=O)NO