Reaction Details
TargetInterstitial collagenase
LigandBDBM50082541
Substrate/Competitorn/a
Meas. Tech.ChEMBL_105952 (CHEMBL715366)
IC50 0.70±n/a nM
Citation Almstead, NGBradley, RSPikul, SDe, BNatchus, MGTaiwo, YOGu, FWilliams, LEHynd, BAJanusz, MJDunaway, CMMieling, GE Design, synthesis, and biological evaluation of potent thiazine- and thiazepine-based matrix metalloproteinase inhibitors. J Med Chem42:4547-62 (1999) Interstitial collagenase
Name:Interstitial collagenase
Type:Enzyme
Mol. Mass.:54010.26
Organism:Homo sapiens (Human)
Description: P03956
Residue:469
BDBM50082541
NameBDBM50082541
Synonyms:(S)-4-(4-Bromo-benzenesulfonyl)-2,2-dimethyl-[1,4]thiazepane-3-carboxylic acid hydroxyamide CHEMBL140511
TypeSmall organic molecule
Emp. Form.C14H19BrN2O4S2
Mol. Mass.423.346
SMILESCC1(C)SCCCN([C@H]1C(=O)NO)S(=O)(=O)c1ccc(Br)cc1