Reaction Details
TargetProthrombin
LigandBDBM50082577
Substrate/Competitorn/a
Meas. Tech.ChEMBL_210598 (CHEMBL816565)
Ki 23±n/a nM
Citation Brundish, DBull, ADonovan, VFullerton, JDGarman, SMHayler, JFJanus, DKane, PDMcDonnell, MSmith, GPWakeford, RWalker, CVHowarth, GHoyle, WAllen, MCAmbler, JButler, KTalbot, MD Design and synthesis of thrombin inhibitors: analogues of MD-805 with reduced stereogenicity and improved potency. J Med Chem42:4584-603 (1999) Prothrombin
Name:Prothrombin
Type:Enzyme
Mol. Mass.:70502.73
Organism:Bos taurus (Bovine)
Description:P00735
Residue:625
BDBM50082577
NameBDBM50082577
Synonyms:3-Methyl-1,2,3,4-tetrahydro-quinoline-8-sulfonic acid [4-guanidino-1-((S)-2-hydroxymethyl-piperidine-1-carbonyl)-butyl]-amide | CHEMBL342910
TypeSmall organic molecule
Emp. Form.C22H36N6O4S
Mol. Mass.480.624
SMILESCC1CNc2c(C1)cccc2S(=O)(=O)NC(CCCNC(N)=N)C(=O)N1CCCC[C@H]1CO