Reaction Details
TargetProthrombin
LigandBDBM50082578
Substrate/Competitorn/a
Meas. Tech.ChEMBL_210598 (CHEMBL816565)
Ki 6.6±n/a nM
Citation Brundish, DBull, ADonovan, VFullerton, JDGarman, SMHayler, JFJanus, DKane, PDMcDonnell, MSmith, GPWakeford, RWalker, CVHowarth, GHoyle, WAllen, MCAmbler, JButler, KTalbot, MD Design and synthesis of thrombin inhibitors: analogues of MD-805 with reduced stereogenicity and improved potency. J Med Chem42:4584-603 (1999) Prothrombin
Name:Prothrombin
Type:Enzyme
Mol. Mass.:70502.73
Organism:Bos taurus (Bovine)
Description:P00735
Residue:625
BDBM50082578
NameBDBM50082578
Synonyms:6-Chloro-3,3-dimethyl-1,2,3,4-tetrahydro-quinoline-8-sulfonic acid {1-[4-(2-fluoro-ethyl)-piperidine-1-carbonyl]-4-guanidino-butyl}-amide | CHEMBL143896
TypeSmall organic molecule
Emp. Form.C24H38ClFN6O3S
Mol. Mass.545.113
SMILESCC1(C)CNc2c(C1)cc(Cl)cc2S(=O)(=O)NC(CCCNC(N)=N)C(=O)N1CCC(CCF)CC1