Reaction Details
TargetC-C chemokine receptor type 1
LigandBDBM50082677
Substrate/Competitorn/a
Meas. Tech.ChEMBL_41751 (CHEMBL651702)
Ki 224±n/a nM
Citation Ng, HPMay, KBauman, JGGhannam, AIslam, ILiang, MHoruk, RHesselgesser, JSnider, RMPerez, HDMorrissey, MM Discovery of novel non-peptide CCR1 receptor antagonists. J Med Chem42:4680-94 (1999) C-C chemokine receptor type 1
Name:C-C chemokine receptor type 1
Type:Enzyme
Mol. Mass.:41180.69
Organism:Homo sapiens (Human)
Description:P32246
Residue:355
BDBM50082677
NameBDBM50082677
Synonyms:5-{3-[4-(4-Chloro-3-trifluoromethyl-phenyl)-4-hydroxy-piperidin-1-yl]-propyl}-5,11-dihydro-10-thia-dibenzo[a,d]cycloheptene-5-carbonitrile | CHEMBL143814
TypeSmall organic molecule
Emp. Form.C30H28ClF3N2OS
Mol. Mass.557.069
SMILESOC1(CCN(CCCC2(C#N)c3ccccc3CSc3ccccc23)CC1)c1ccc(Cl)c(c1)C(F)(F)F