Reaction Details
TargetC-C chemokine receptor type 1
LigandBDBM50082667
Substrate/Competitorn/a
Meas. Tech.ChEMBL_79549 (CHEMBL691179)
IC50 400±n/a nM
Citation Ng, HPMay, KBauman, JGGhannam, AIslam, ILiang, MHoruk, RHesselgesser, JSnider, RMPerez, HDMorrissey, MM Discovery of novel non-peptide CCR1 receptor antagonists. J Med Chem42:4680-94 (1999) C-C chemokine receptor type 1
Name:C-C chemokine receptor type 1
Type:Enzyme
Mol. Mass.:41180.69
Organism:Homo sapiens (Human)
Description:P32246
Residue:355
BDBM50082667
NameBDBM50082667
Synonyms:4-[4-(4-Chloro-phenyl)-4-hydroxy-piperidin-1-yl]-2,2-diphenyl-butyronitrile | CHEMBL357919
TypeSmall organic molecule
Emp. Form.C27H27ClN2O
Mol. Mass.430.969
SMILESOC1(CCN(CCC(C#N)(c2ccccc2)c2ccccc2)CC1)c1ccc(Cl)cc1