Reaction Details
TargetC-C chemokine receptor type 1
LigandBDBM50082725
Substrate/Competitorn/a
Meas. Tech.ChEMBL_41751 (CHEMBL651702)
Ki 206±n/a nM
Citation Ng, HPMay, KBauman, JGGhannam, AIslam, ILiang, MHoruk, RHesselgesser, JSnider, RMPerez, HDMorrissey, MM Discovery of novel non-peptide CCR1 receptor antagonists. J Med Chem42:4680-94 (1999) C-C chemokine receptor type 1
Name:C-C chemokine receptor type 1
Type:Enzyme
Mol. Mass.:41180.69
Organism:Homo sapiens (Human)
Description:P32246
Residue:355
BDBM50082725
NameBDBM50082725
Synonyms:5-(4'-Hydroxy-3',4',5',6'-tetrahydro-2'H-[3,4']bipyridinyl-1'-yl)-2,2-diphenyl-pentanenitrile | CHEMBL141020
TypeSmall organic molecule
Emp. Form.C27H29N3O
Mol. Mass.411.5387
SMILESOC1(CCN(CCCC(C#N)(c2ccccc2)c2ccccc2)CC1)c1cccnc1