Reaction Details
TargetC-C chemokine receptor type 1
LigandBDBM50082701
Substrate/Competitorn/a
Meas. Tech.ChEMBL_41751 (CHEMBL651702)
Ki 74±n/a nM
Citation Ng, HPMay, KBauman, JGGhannam, AIslam, ILiang, MHoruk, RHesselgesser, JSnider, RMPerez, HDMorrissey, MM Discovery of novel non-peptide CCR1 receptor antagonists. J Med Chem42:4680-94 (1999) C-C chemokine receptor type 1
Name:C-C chemokine receptor type 1
Type:Enzyme
Mol. Mass.:41180.69
Organism:Homo sapiens (Human)
Description:P32246
Residue:355
BDBM50082701
NameBDBM50082701
Synonyms:2-(3-Bromo-4-methoxy-phenyl)-5-[4-(4-chloro-phenyl)-4-hydroxy-piperidin-1-yl]-pentanenitrile | CHEMBL142468
TypeSmall organic molecule
Emp. Form.C23H26BrClN2O2
Mol. Mass.477.822
SMILESCOc1ccc(cc1Br)C(CCCN1CCC(O)(CC1)c1ccc(Cl)cc1)C#N