Reaction Details
TargetAlpha-1B adrenergic receptor
LigandBDBM50082792
Substrate/Competitorn/a
Meas. Tech.ChEMBL_34457 (CHEMBL651989)
Ki 27±n/a nM
Citation Nagarathnam, DMiao, SWLagu, BChiu, GFang, JMurali Dhar, TGZhang, JTyagarajan, SMarzabadi, MRZhang, FWong, WCSun, WTian, DWetzel, JMForray, CChang, RSBroten, TPRansom, RWSchorn, TWChen, TBO'Malley, SKling, PSchneck, KBendesky, RHarrell, CM Design and synthesis of novel alpha(1)(a) adrenoceptor-selective antagonists. 1. Structure-activity relationship in dihydropyrimidinones. J Med Chem42:4764-77 (1999) Alpha-1B adrenergic receptor
Name:Alpha-1B adrenergic receptor
Type:Enzyme
Mol. Mass.:56862.13
Organism:Homo sapiens (Human)
Description:P35368
Residue:520
BDBM50082792
NameBDBM50082792
Synonyms:4-Benzo[1,2,5]oxadiazol-5-yl-3-[3-(4-methoxycarbonyl-4-phenyl-piperidin-1-yl)-propylcarbamoyl]-6-methyl-2-oxo-1,2,3,4-tetrahydro-pyrimidine-5-carboxylic acid methyl ester | CHEMBL142743
TypeSmall organic molecule
Emp. Form.C30H34N6O7
Mol. Mass.590.627
SMILESCOC(=O)C1=C(C)NC(=O)N(C1c1ccc2nonc2c1)C(=O)NCCCN1CCC(CC1)(C(=O)OC)c1ccccc1