Reaction Details
TargetAlpha-1A adrenergic receptor
LigandBDBM50082786
Substrate/Competitorn/a
Meas. Tech.ChEMBL_33739 (CHEMBL873186)
Ki 1.8±n/a nM
Citation Nagarathnam, DMiao, SWLagu, BChiu, GFang, JMurali Dhar, TGZhang, JTyagarajan, SMarzabadi, MRZhang, FWong, WCSun, WTian, DWetzel, JMForray, CChang, RSBroten, TPRansom, RWSchorn, TWChen, TBO'Malley, SKling, PSchneck, KBendesky, RHarrell, CM Design and synthesis of novel alpha(1)(a) adrenoceptor-selective antagonists. 1. Structure-activity relationship in dihydropyrimidinones. J Med Chem42:4764-77 (1999) Alpha-1A adrenergic receptor
Name:Alpha-1A adrenergic receptor
Type:Cell-surface receptors
Mol. Mass.:51511.67
Organism:Homo sapiens (Human)
Description:P35348
Residue:466
BDBM50082786
NameBDBM50082786
Synonyms:3-[3-(4-Methoxycarbonyl-4-phenyl-piperidin-1-yl)-propylcarbamoyl]-6-methyl-2-oxo-4-m-tolyl-1,2,3,4-tetrahydro-pyrimidine-5-carboxylic acid methyl ester | CHEMBL358489
TypeSmall organic molecule
Emp. Form.C31H38N4O6
Mol. Mass.562.6566
SMILESCOC(=O)C1=C(C)NC(=O)N(C1c1cccc(C)c1)C(=O)NCCCN1CCC(CC1)(C(=O)OC)c1ccccc1