Reaction Details
TargetAlpha-1A adrenergic receptor
LigandBDBM50082802
Substrate/Competitorn/a
Meas. Tech.ChEMBL_33739 (CHEMBL873186)
Ki 0.70±n/a nM
Citation Nagarathnam, DMiao, SWLagu, BChiu, GFang, JMurali Dhar, TGZhang, JTyagarajan, SMarzabadi, MRZhang, FWong, WCSun, WTian, DWetzel, JMForray, CChang, RSBroten, TPRansom, RWSchorn, TWChen, TBO'Malley, SKling, PSchneck, KBendesky, RHarrell, CM Design and synthesis of novel alpha(1)(a) adrenoceptor-selective antagonists. 1. Structure-activity relationship in dihydropyrimidinones. J Med Chem42:4764-77 (1999) Alpha-1A adrenergic receptor
Name:Alpha-1A adrenergic receptor
Type:Cell-surface receptors
Mol. Mass.:51511.67
Organism:Homo sapiens (Human)
Description:P35348
Residue:466
BDBM50082802
NameBDBM50082802
Synonyms:1-(3-{[5-Carbamoyl-4-methyl-6-(4-nitro-phenyl)-2-oxo-3,6-dihydro-2H-pyrimidine-1-carbonyl]-amino}-propyl)-4-phenyl-piperidine-4-carboxylic acid methyl ester | CHEMBL145562
TypeSmall organic molecule
Emp. Form.C29H34N6O7
Mol. Mass.578.6163
SMILESCOC(=O)C1(CCN(CCCNC(=O)N2C(C(C(N)=O)=C(C)NC2=O)c2ccc(cc2)[N+]([O-])=O)CC1)c1ccccc1