Reaction Details
TargetAlpha-1A adrenergic receptor
LigandBDBM50082798
Substrate/Competitorn/a
Meas. Tech.ChEMBL_33739 (CHEMBL873186)
Ki 0.20±n/a nM
Citation Nagarathnam, DMiao, SWLagu, BChiu, GFang, JMurali Dhar, TGZhang, JTyagarajan, SMarzabadi, MRZhang, FWong, WCSun, WTian, DWetzel, JMForray, CChang, RSBroten, TPRansom, RWSchorn, TWChen, TBO'Malley, SKling, PSchneck, KBendesky, RHarrell, CM Design and synthesis of novel alpha(1)(a) adrenoceptor-selective antagonists. 1. Structure-activity relationship in dihydropyrimidinones. J Med Chem42:4764-77 (1999) Alpha-1A adrenergic receptor
Name:Alpha-1A adrenergic receptor
Type:Cell-surface receptors
Mol. Mass.:51511.67
Organism:Homo sapiens (Human)
Description:P35348
Residue:466
BDBM50082798
NameBDBM50082798
Synonyms:4-(2,4-Difluoro-phenyl)-3-[3-(4-methoxycarbonyl-4-phenyl-piperidin-1-yl)-propylcarbamoyl]-6-methyl-2-oxo-1,2,3,4-tetrahydro-pyrimidine-5-carboxylic acid methyl ester | CHEMBL141444
TypeSmall organic molecule
Emp. Form.C30H34F2N4O6
Mol. Mass.584.611
SMILESCOC(=O)C1=C(C)NC(=O)N(C1c1ccc(F)cc1F)C(=O)NCCCN1CCC(CC1)(C(=O)OC)c1ccccc1